Reaction Details
TargetPolyunsaturated fatty acid lipoxygenase ALOX15B
LigandBDBM50009001
Substrate/Competitorn/a
Meas. Tech.IC50 Assay
pH7.3±n/a
Temperature298.15±n/a K
IC50>1.00e+5±n/a nM
Commentsextracted
Citation Mascayano, CEspinosa, VSepúlveda-Boza, SHoobler, EKPerry, SDiaz, GHolman, TR Enzymatic Studies of Isoflavonoids as Selective and Potent Inhibitors of Human Leukocyte 5-Lipo-Oxygenase. Chem Biol Drug Des86:114-21 (2015) 
 
Polyunsaturated fatty acid lipoxygenase ALOX15B
Name:Polyunsaturated fatty acid lipoxygenase ALOX15B
Type:Protein
Mol. Mass.:75850.40
Organism:Homo sapiens (Human)
Description:n/a
Residue:676
BDBM50009001
NameBDBM50009001
Synonyms:5,6,7-Trihydroxyflavone Baicalein Baicalein, 8 US10252984, Table 2.33
TypeSmall organic molecule
Emp. Form.C15H10O5
Mol. Mass.270.2369
SMILESOc1cc2oc(cc(=O)c2c(O)c1O)-c1ccccc1