Reaction Details
TargetPolyunsaturated fatty acid 5-lipoxygenase
LigandBDBM106774
Substrate/Competitorn/a
Meas. Tech.IC50 Assay
pH7.3±n/a
Temperature298.15±n/a K
IC50 3.1e+4±n/a nM
Commentsextracted
Citation Mascayano, CEspinosa, VSepúlveda-Boza, SHoobler, EKPerry, SDiaz, GHolman, TR Enzymatic Studies of Isoflavonoids as Selective and Potent Inhibitors of Human Leukocyte 5-Lipo-Oxygenase. Chem Biol Drug Des86:114-21 (2015) 
 
Polyunsaturated fatty acid 5-lipoxygenase
Name:Polyunsaturated fatty acid 5-lipoxygenase
Type:Enzyme
Mol. Mass.:77972.74
Organism:Homo sapiens (Human)
Description:Recombinant protein was purified from E. coli lysate. After ammonium sulfate precipitation and subsequent steps, the supernatant (S100) was used for 5-LO activity assay.
Residue:674
BDBM106774
NameBDBM106774
Synonyms:3‐(4‐chlorophenyl)‐6,7‐dihydroxy‐4H‐chromen‐4‐one IR-5
TypeSmall organic molecule
Emp. Form.C15H9ClO4
Mol. Mass.288.683
SMILESOc1cc2occ(-c3ccc(Cl)cc3)c(=O)c2cc1O