Reaction Details
TargetPolyunsaturated fatty acid 5-lipoxygenase
LigandBDBM50139862
Substrate/Competitorn/a
Meas. Tech.IC50 Assay
pH7.3±n/a
Temperature298.15±n/a K
IC50 3e+2± 5e+1 nM
Commentsextracted
Citation Mascayano, CEspinosa, VSepúlveda-Boza, SHoobler, EKPerry, SDiaz, GHolman, TR Enzymatic Studies of Isoflavonoids as Selective and Potent Inhibitors of Human Leukocyte 5-Lipo-Oxygenase. Chem Biol Drug Des86:114-21 (2015) 
 
Polyunsaturated fatty acid 5-lipoxygenase
Name:Polyunsaturated fatty acid 5-lipoxygenase
Type:Enzyme
Mol. Mass.:77972.74
Organism:Homo sapiens (Human)
Description:Recombinant protein was purified from E. coli lysate. After ammonium sulfate precipitation and subsequent steps, the supernatant (S100) was used for 5-LO activity assay.
Residue:674
BDBM50139862
NameBDBM50139862
Synonyms:3-(4-Hydroxy-phenyl)-chroman-6,7-diol CHEMBL8328 | HIR-1
TypeSmall organic molecule
Emp. Form.C15H14O4
Mol. Mass.258.2693
SMILESOc1ccc(cc1)C1COc2cc(O)c(O)cc2C1