Reaction Details
TargetPhosphodiesterase
LigandBDBM153390
Substrate/Competitorn/a
Meas. Tech.TbrPDEB1 Enzyme Assay
pH7.4±n/a
IC50 3.5e+3± 3e+2 nM
Commentsextracted
Citation Ochiana, SOBland, NDSettimo, LCampbell, RKPollastri, MP Repurposing human PDE4 inhibitors for neglected tropical diseases. Evaluation of analogs of the human PDE4 inhibitor GSK-256066 as inhibitors of PDEB1 of Trypanosoma brucei. Chem Biol Drug Des85:549-64 (2015) 
 
Phosphodiesterase
Name:Phosphodiesterase
Type:Protein
Mol. Mass.:103683.20
Organism:Trypanosoma brucei
Description:n/a
Residue:930
BDBM153390
NameBDBM153390
Synonyms:Methyl 3-(3-carbamoyl-4-(3-methoxyphenylamino)-8-methylquinolin-6-ylsulfonyl)benzoate (10a)
TypeSmall organic molecule
Emp. Form.C26H23N3O6S
Mol. Mass.505.542
SMILESCOC(=O)c1cccc(c1)S(=O)(=O)c1cc(C)c2ncc(C(N)=O)c(Nc3cccc(OC)c3)c2c1