Reaction Details
TargetPhosphodiesterase
LigandBDBM153393
Substrate/Competitorn/a
Meas. Tech.TbrPDEB1 Enzyme Assay
pH7.4±n/a
IC50 1.6e+4± 1.7e+3 nM
Commentsextracted
Citation Ochiana, SOBland, NDSettimo, LCampbell, RKPollastri, MP Repurposing human PDE4 inhibitors for neglected tropical diseases. Evaluation of analogs of the human PDE4 inhibitor GSK-256066 as inhibitors of PDEB1 of Trypanosoma brucei. Chem Biol Drug Des85:549-64 (2015) 
 
Phosphodiesterase
Name:Phosphodiesterase
Type:Protein
Mol. Mass.:103683.20
Organism:Trypanosoma brucei
Description:n/a
Residue:930
BDBM153393
NameBDBM153393
Synonyms:Methyl 3-(3-carbamoyl-4-(3-methoxyphenylamino)-8-methylquinolin-6-ylamino)benzoate (13)
TypeSmall organic molecule
Emp. Form.C26H24N4O4
Mol. Mass.456.4932
SMILESCOC(=O)c1cccc(Nc2cc(C)c3ncc(C(N)=O)c(Nc4cccc(OC)c4)c3c2)c1