Reaction Details
TargetPhosphodiesterase
LigandBDBM153397
Substrate/Competitorn/a
Meas. Tech.TbrPDEB1 Enzyme Assay
pH7.4±n/a
IC50 6.7e+3± 2.9e+3 nM
Commentsextracted
Citation Ochiana, SOBland, NDSettimo, LCampbell, RKPollastri, MP Repurposing human PDE4 inhibitors for neglected tropical diseases. Evaluation of analogs of the human PDE4 inhibitor GSK-256066 as inhibitors of PDEB1 of Trypanosoma brucei. Chem Biol Drug Des85:549-64 (2015) 
 
Phosphodiesterase
Name:Phosphodiesterase
Type:Protein
Mol. Mass.:103683.20
Organism:Trypanosoma brucei
Description:n/a
Residue:930
BDBM153397
NameBDBM153397
Synonyms:6-(3-(1H-Tetrazol-5-yl)phenyl)-4-((3-methoxyphenyl)amino)-8-methylquinoline-3-carboxamide (17m)
TypeSmall organic molecule
Emp. Form.C25H21N7O2
Mol. Mass.451.4799
SMILESCOc1cccc(Nc2c(cnc3c(C)cc(cc23)-c2cccc(c2)-c2nnn[nH]2)C(N)=O)c1