Reaction Details
TargetPhosphodiesterase
LigandBDBM153400
Substrate/Competitorn/a
Meas. Tech.TbrPDEB1 Enzyme Assay
pH7.4±n/a
IC50 1.2e+4± 2.7e+3 nM
Commentsextracted
Citation Ochiana, SOBland, NDSettimo, LCampbell, RKPollastri, MP Repurposing human PDE4 inhibitors for neglected tropical diseases. Evaluation of analogs of the human PDE4 inhibitor GSK-256066 as inhibitors of PDEB1 of Trypanosoma brucei. Chem Biol Drug Des85:549-64 (2015) 
 
Phosphodiesterase
Name:Phosphodiesterase
Type:Protein
Mol. Mass.:103683.20
Organism:Trypanosoma brucei
Description:n/a
Residue:930
BDBM153400
NameBDBM153400
Synonyms:4-((3-Methoxyphenyl)amino)-8-methyl-6-(3-morpholinophenyl)quinoline-3-carboxamide (17s)
TypeSmall organic molecule
Emp. Form.C28H28N4O3
Mol. Mass.468.5469
SMILESCOc1cccc(Nc2c(cnc3c(C)cc(cc23)-c2cccc(c2)N2CCOCC2)C(N)=O)c1