Reaction Details
TargetPhosphodiesterase
LigandBDBM153405
Substrate/Competitorn/a
Meas. Tech.TbrPDEB1 Enzyme Assay
pH7.4±n/a
IC50 7e+3± 9e+2 nM
Commentsextracted
Citation Ochiana, SOBland, NDSettimo, LCampbell, RKPollastri, MP Repurposing human PDE4 inhibitors for neglected tropical diseases. Evaluation of analogs of the human PDE4 inhibitor GSK-256066 as inhibitors of PDEB1 of Trypanosoma brucei. Chem Biol Drug Des85:549-64 (2015) 
 
Phosphodiesterase
Name:Phosphodiesterase
Type:Protein
Mol. Mass.:103683.20
Organism:Trypanosoma brucei
Description:n/a
Residue:930
BDBM153405
NameBDBM153405
Synonyms:4-((2-Methoxyphenyl)amino)-8-methyl-6-(1-methyl-1H-indazol-6-yl)quinoline-3-carboxamide, formic acid salt (24b)
TypeSmall organic molecule
Emp. Form.C27H25N5O4
Mol. Mass.483.5185
SMILESOC=O.COc1ccccc1Nc1c(cnc2c(C)cc(cc12)-c1ccc2cnn(C)c2c1)C(N)=O