Reaction Details
TargetPhosphodiesterase
LigandBDBM153409
Substrate/Competitorn/a
Meas. Tech.TbrPDEB1 Enzyme Assay
pH7.4±n/a
IC50 3.7e+3± 2e+2 nM
Commentsextracted
Citation Ochiana, SOBland, NDSettimo, LCampbell, RKPollastri, MP Repurposing human PDE4 inhibitors for neglected tropical diseases. Evaluation of analogs of the human PDE4 inhibitor GSK-256066 as inhibitors of PDEB1 of Trypanosoma brucei. Chem Biol Drug Des85:549-64 (2015) 
 
Phosphodiesterase
Name:Phosphodiesterase
Type:Protein
Mol. Mass.:103683.20
Organism:Trypanosoma brucei
Description:n/a
Residue:930
BDBM153409
NameBDBM153409
Synonyms:4-(4-Methoxy-3-methylphenylamino)-8-methyl-6-(1-methyl-1H-indazol-6-yl)quinoline-3-carboxamide, formic acid salt (24f)
TypeSmall organic molecule
Emp. Form.C28H27N5O4
Mol. Mass.497.5451
SMILESOC=O.COc1ccc(Nc2c(cnc3c(C)cc(cc23)-c2ccc3cnn(C)c3c2)C(N)=O)cc1C