Reaction Details
TargetPhosphodiesterase
LigandBDBM153410
Substrate/Competitorn/a
Meas. Tech.TbrPDEB1 Enzyme Assay
pH7.4±n/a
IC50 5.9e+3± 6.7e+2 nM
Commentsextracted
Citation Ochiana, SOBland, NDSettimo, LCampbell, RKPollastri, MP Repurposing human PDE4 inhibitors for neglected tropical diseases. Evaluation of analogs of the human PDE4 inhibitor GSK-256066 as inhibitors of PDEB1 of Trypanosoma brucei. Chem Biol Drug Des85:549-64 (2015) 
 
Phosphodiesterase
Name:Phosphodiesterase
Type:Protein
Mol. Mass.:103683.20
Organism:Trypanosoma brucei
Description:n/a
Residue:930
BDBM153410
NameBDBM153410
Synonyms:4-(Cyclopentylamino)-8-methyl-6-(3-(oxazol-2-yl)phenyl)quinoline-3-carboxamide (28)
TypeSmall organic molecule
Emp. Form.C25H24N4O2
Mol. Mass.412.4837
SMILESCc1cc(cc2c(NC3CCCC3)c(cnc12)C(N)=O)-c1cccc(c1)-c1ncco1