Reaction Details
TargetcAMP-specific 3',5'-cyclic phosphodiesterase 4A
LigandBDBM153402
Substrate/Competitorn/a
Meas. Tech.Human PDE4B Biochemical Assay
IC50 8.3e+4±n/a nM
Citation Ochiana, SOBland, NDSettimo, LCampbell, RKPollastri, MP Repurposing human PDE4 inhibitors for neglected tropical diseases. Evaluation of analogs of the human PDE4 inhibitor GSK-256066 as inhibitors of PDEB1 of Trypanosoma brucei. Chem Biol Drug Des85:549-64 (2015) 
 
cAMP-specific 3',5'-cyclic phosphodiesterase 4A
Name:cAMP-specific 3',5'-cyclic phosphodiesterase 4A
Type:Enzyme
Mol. Mass.:98113.27
Organism:Homo sapiens (Human)
Description:P27815
Residue:886
BDBM153402
NameBDBM153402
Synonyms:4-((3-Methoxyphenyl)amino)-8-methyl-6-(1-methyl-1H-indazol-6-yl)quinoline-3-carboxamide (19a)
TypeSmall organic molecule
Emp. Form.C26H23N5O2
Mol. Mass.437.4931
SMILESCOc1cccc(Nc2c(cnc3c(C)cc(cc23)-c2ccc3cnn(C)c3c2)C(N)=O)c1