Reaction Details
TargetAmine oxidase [flavin-containing] A
LigandBDBM50359396
Substrate/Competitorn/a
Meas. Tech.Inhibition Assay
pH7.4±n/a
Temperature310.15±n/a K
IC50 6700±n/a nM
Commentsextracted
Citation Samadi, AMarco Contelles, JLBolea Tomás, ILuque Garriga, FJUnzeta López, M Derivatives of propargylamine having neuroprotective capacity for the treatment of Alzheimer's and Parkinson's diseases US Patent US8999994 Publication Date 4/7/2015
 
Amine oxidase [flavin-containing] A
Name:Amine oxidase [flavin-containing] A
Type:Enzyme
Mol. Mass.:59515.21
Organism:Rattus norvegicus (rat)
Description:n/a
Residue:526
BDBM50359396
NameBDBM50359396
Synonyms:CHEMBL1929420 | US8999994, 5
TypeSmall organic molecule
Emp. Form.C28H35N3O
Mol. Mass.429.597
SMILESCN(CC#C)Cc1cc2cc(OCCC3CCN(Cc4ccccc4)CC3)ccc2n1C