Reaction Details
TargetTyrosine-protein kinase JAK1
LigandBDBM153671
Substrate/Competitorn/a
Meas. Tech.Inhibition Assay
pH7.2±n/a
Ki 0.5±n/a nM
Commentsextracted
Citation Gibbons, PHanan, ELiu, WLyssikatos, JPMagnuson, SRMendonca, RPastor, RRawson, TESiu, MZak, MZhou, AZhu, B Pyrazolopyrimidine JAK inhibitor compounds and methods US Patent US8999998 Publication Date 4/7/2015
 
Tyrosine-protein kinase JAK1
Name:Tyrosine-protein kinase JAK1
Type:Protein
Mol. Mass.:133293.73
Organism:Homo sapiens (Human)
Description:P23458
Residue:1154
BDBM153671
NameBDBM153671
Synonyms:US8999998, 300
TypeSmall organic molecule
Emp. Form.C24H22ClN7O3
Mol. Mass.491.93
SMILESCOc1ccc(Cl)cc1-c1nn(CC(=O)N2CCC=CC2)cc1NC(=O)c1cnn2cccnc12