Reaction Details
TargetTyrosine-protein kinase JAK2
LigandBDBM153666
Substrate/Competitorn/a
Meas. Tech.Inhibition Assay
pH7.2±n/a
Ki 1.5±n/a nM
Commentsextracted
Citation Gibbons, PHanan, ELiu, WLyssikatos, JPMagnuson, SRMendonca, RPastor, RRawson, TESiu, MZak, MZhou, AZhu, B Pyrazolopyrimidine JAK inhibitor compounds and methods US Patent US8999998 Publication Date 4/7/2015
 
Tyrosine-protein kinase JAK2
Name:Tyrosine-protein kinase JAK2
Type:Protein
Mol. Mass.:130684.68
Organism:Homo sapiens (Human)
Description:O60674
Residue:1132
BDBM153666
NameBDBM153666
Synonyms:US8999998, 158
TypeSmall organic molecule
Emp. Form.C17H12N8O2
Mol. Mass.360.3296
SMILESCOc1ncc(cc1-c1n[nH]cc1NC(=O)c1cnn2cccnc12)C#N