Reaction Details
TargetMetallo-beta-lactamase VIM-2
LigandBDBM153699
Substrate/Competitorn/a
Meas. Tech.Direct Competition Assay
Ki 5.4e+3± 4e+2 nM
Citation Mojica, MFMahler, SGBethel, CRTaracila, MAKosmopoulou, MPapp-Wallace, KMLlarrull, LIWilson, BMMarshall, SHWallace, CJVillegas, MVHarris, MEVila, AJSpencer, JBonomo, RA Exploring the Role of Residue 228 in Substrate and Inhibitor Recognition by VIM Metallo-ß-lactamases. Biochemistry54:3183-96 (2015) 
 
Metallo-beta-lactamase VIM-2
Name:Metallo-beta-lactamase VIM-2
Type:Protein
Mol. Mass.:28318.00
Organism:Pseudomonas aeruginosa (g-Proteobacteria)
Description:n/a
Residue:266
BDBM153699
NameBDBM153699
Synonyms:D-CS319
TypeSmall organic molecule
Emp. Form.C7H11NO2S3
Mol. Mass.237.363
SMILESOC(=O)[C@H]1CS[C@@H]2CS[C@@H](CS)N12