Reaction Details
TargetVIM-24
LigandBDBM153700
Substrate/Competitorn/a
Meas. Tech.Direct Competition Assay
Ki 4.9e+3± 3e+2 nM
Citation Mojica, MFMahler, SGBethel, CRTaracila, MAKosmopoulou, MPapp-Wallace, KMLlarrull, LIWilson, BMMarshall, SHWallace, CJVillegas, MVHarris, MEVila, AJSpencer, JBonomo, RA Exploring the Role of Residue 228 in Substrate and Inhibitor Recognition by VIM Metallo-ß-lactamases. Biochemistry54:3183-96 (2015) 
 
VIM-24
Name:VIM-24
Synonyms:Metallo-beta-lactamase VIM-24 (VIM-24)
Type:Protein
Mol. Mass.:28273.97
Organism:Klebsiella pneumoniae (Enterobacteria)
Description:E0AFT6
Residue:266
BDBM153700
NameBDBM153700
Synonyms:L-VC26
TypeSmall organic molecule
Emp. Form.C9H15NO2S3
Mol. Mass.265.416
SMILESCC1(C)S[C@H]2CS[C@H](CS)N2[C@@H]1C(O)=O