Reaction Details
TargetRAC-alpha serine/threonine-protein kinase [E49C,C296S,C310S,C344S]
LigandBDBM153703
Substrate/Competitorn/a
Meas. Tech.KinEASE Assay
IC50 10± 4 nM
Citation Fang, ZSimard, JRPlenker, DNguyen, HDPhan, TWolle, PBaumeister, SRauh, D Discovery of inter-domain stabilizers-a novel assay system for allosteric akt inhibitors. ACS Chem Biol10:279-88 (2015) 
 
RAC-alpha serine/threonine-protein kinase [E49C,C296S,C310S,C344S]
Name:RAC-alpha serine/threonine-protein kinase [E49C,C296S,C310S,C344S]
Type:Protein
Mol. Mass.:55608.09
Organism:Homo sapiens (Human)
Description:Human Akt1 containing mutations E49C, C296S, C310S and C344S
Residue:480
BDBM153703
NameBDBM153703
Synonyms:2-(4-((4-(5-Chloro-2-oxo-2,3-dihydro-1H-benzo[d]imidazol-1-yl)piperidin-1-yl)methyl)phenyl)-3-phenyl-1,6-naphthyridin-5(6H)-one (7b)
TypeSmall organic molecule
Emp. Form.C33H28ClN5O2
Mol. Mass.562.061
SMILESClc1ccc2n(C3CCN(Cc4ccc(cc4)-c4nc5cc[nH]c(=O)c5cc4-c4ccccc4)CC3)c(=O)[nH]c2c1