Reaction Details
TargetRAC-alpha serine/threonine-protein kinase [E49C,C296S,C310S,C344S]
LigandBDBM25013
Substrate/Competitorn/a
Meas. Tech.KinEASE Assay
IC50 0.4± 0.2 nM
Citation Fang, ZSimard, JRPlenker, DNguyen, HDPhan, TWolle, PBaumeister, SRauh, D Discovery of inter-domain stabilizers-a novel assay system for allosteric akt inhibitors. ACS Chem Biol10:279-88 (2015) 
 
RAC-alpha serine/threonine-protein kinase [E49C,C296S,C310S,C344S]
Name:RAC-alpha serine/threonine-protein kinase [E49C,C296S,C310S,C344S]
Type:Protein
Mol. Mass.:55608.09
Organism:Homo sapiens (Human)
Description:Human Akt1 containing mutations E49C, C296S, C310S and C344S
Residue:480
BDBM25013
NameBDBM25013
Synonyms:4-[2-(4-amino-1,2,5-oxadiazol-3-yl)-1-ethyl-7-[(3S)-piperidin-3-ylmethoxy]-1H-imidazo[4,5-c]pyridin-4-yl]-2-methylbut-3-yn-2-ol GSK690693 | US10550114, Compound GSK690693
TypeSmall organic molecule
Emp. Form.C21H27N7O3
Mol. Mass.425.4842
SMILESCCn1c(nc2c(ncc(OC[C@H]3CCCNC3)c12)C#CC(C)(C)O)-c1nonc1N