Reaction Details
TargetRAC-alpha serine/threonine-protein kinase [E49C,C296S,C310S,C344S]
LigandBDBM50237622
Substrate/Competitorn/a
Meas. Tech.KinEASE Assay
IC50 29± 9 nM
Citation Fang, ZSimard, JRPlenker, DNguyen, HDPhan, TWolle, PBaumeister, SRauh, D Discovery of inter-domain stabilizers-a novel assay system for allosteric akt inhibitors. ACS Chem Biol10:279-88 (2015) 
 
RAC-alpha serine/threonine-protein kinase [E49C,C296S,C310S,C344S]
Name:RAC-alpha serine/threonine-protein kinase [E49C,C296S,C310S,C344S]
Type:Protein
Mol. Mass.:55608.09
Organism:Homo sapiens (Human)
Description:Human Akt1 containing mutations E49C, C296S, C310S and C344S
Residue:480
BDBM50237622
NameBDBM50237622
Synonyms:4-(4-Chlorobenzyl)-1-(7H-pyrrolo[2,3-d]pyrimidin-4-yl)piperidin- CCT128930 US8796293, 17
TypeSmall organic molecule
Emp. Form.C18H20ClN5
Mol. Mass.341.838
SMILESNC1(Cc2ccc(Cl)cc2)CCN(CC1)c1ncnc2[nH]ccc12