Reaction Details
TargetSerine/threonine-protein kinase TBK1
LigandBDBM25008
Substrate/Competitorn/a
Meas. Tech.KinEASE-STK Assay
IC50 718± 32 nM
Citation Richters, ABasu, DEngel, JErcanoglu, MSBalke-Want, HTesch, RThomas, RKRauh, D Identification and further development of potent TBK1 inhibitors. ACS Chem Biol10:289-98 (2015) 
 
Serine/threonine-protein kinase TBK1
Name:Serine/threonine-protein kinase TBK1
Type:protein
Mol. Mass.:83645.20
Organism:Homo sapiens (Human)
Description:Q9UHD2
Residue:729
BDBM25008
NameBDBM25008
Synonyms:4-[2-(4-amino-1,2,5-oxadiazol-3-yl)-1-ethyl-7-(piperidin-4-ylmethoxy)-1H-imidazo[4,5-c]pyridin-4-yl]-2-methylbut-3-yn-2-ol oxadiazole-containing compound, 3b
TypeSmall organic molecule
Emp. Form.C21H27N7O3
Mol. Mass.425.4842
SMILESCCn1c(nc2c(ncc(OCC3CCNCC3)c12)C#CC(C)(C)O)-c1nonc1N