Reaction Details
TargetSerine/threonine-protein kinase TBK1
LigandBDBM2608
Substrate/Competitorn/a
Meas. Tech.KinEASE-STK Assay
IC50 3.37e+3± 395 nM
Citation Richters, ABasu, DEngel, JErcanoglu, MSBalke-Want, HTesch, RThomas, RKRauh, D Identification and further development of potent TBK1 inhibitors. ACS Chem Biol10:289-98 (2015) 
 
Serine/threonine-protein kinase TBK1
Name:Serine/threonine-protein kinase TBK1
Type:protein
Mol. Mass.:83645.20
Organism:Homo sapiens (Human)
Description:Q9UHD2
Residue:729
BDBM2608
NameBDBM2608
Synonyms:3-(5-amino-1-methyl-1H-indol-3-yl)-4-(1-methyl-1H-indol-3-yl)-2,5-dihydro-1H-pyrrole-2,5-dione ROCHE screening, 43
TypeSmall organic molecule
Emp. Form.C22H18N4O2
Mol. Mass.370.4039
SMILESCn1cc(C2=C(C(=O)NC2=O)c2cn(C)c3ccc(N)cc23)c2ccccc12