Reaction Details
TargetSerine/threonine-protein kinase TBK1
LigandBDBM2623
Substrate/Competitorn/a
Meas. Tech.KinEASE-STK Assay
IC50 971± 122 nM
Citation Richters, ABasu, DEngel, JErcanoglu, MSBalke-Want, HTesch, RThomas, RKRauh, D Identification and further development of potent TBK1 inhibitors. ACS Chem Biol10:289-98 (2015) 
 
Serine/threonine-protein kinase TBK1
Name:Serine/threonine-protein kinase TBK1
Type:protein
Mol. Mass.:83645.20
Organism:Homo sapiens (Human)
Description:Q9UHD2
Residue:729
BDBM2623
NameBDBM2623
Synonyms:1-methyl-3-[4-(1-methyl-1H-indol-3-yl)-2,5-dioxo-2,5-dihydro-1H-pyrrol-3-yl]-1H-indole-6-carboxylic acid ROCHE screening, 44
TypeSmall organic molecule
Emp. Form.C23H17N3O4
Mol. Mass.399.3988
SMILESCn1cc(C2=C(C(=O)NC2=O)c2cn(C)c3cc(ccc23)C(O)=O)c2ccccc12