Reaction Details
TargetSerine/threonine-protein kinase TBK1
LigandBDBM10100
Substrate/Competitorn/a
Meas. Tech.KinEASE-STK Assay
IC50 526± 43 nM
Citation Richters, ABasu, DEngel, JErcanoglu, MSBalke-Want, HTesch, RThomas, RKRauh, D Identification and further development of potent TBK1 inhibitors. ACS Chem Biol10:289-98 (2015) 
 
Serine/threonine-protein kinase TBK1
Name:Serine/threonine-protein kinase TBK1
Type:protein
Mol. Mass.:83645.20
Organism:Homo sapiens (Human)
Description:Q9UHD2
Residue:729
BDBM10100
NameBDBM10100
Synonyms:(3Z)-5-fluoro-4-[(3S)-4-hydroxy-3-(methylamino)but-1-yn-1-yl]-3-[(3-methoxy-1H-pyrrol-2-yl)methylidene]-2,3-dihydro-1H-indol-2-one ROCHE screening, 73
TypeSmall organic molecule
Emp. Form.C19H18FN3O3
Mol. Mass.355.3629
SMILESCN[C@H](CO)C#Cc1c2\C(=C\c3[nH]ccc3OC)C(=O)Nc2ccc1F