Reaction Details
TargetProtein kinase C beta type
LigandBDBM153995
Substrate/Competitorn/a
Meas. Tech.Inhibition Assay
pH7.4±n/a
Temperature303.15±n/a K
Ki<10±n/a nM
Commentsextracted
Citation Botrous, IHong, YLi, HLiu, KKNukui, STeng, MTompkins, EVYin, C 3-amido-pyrrolo[3,4-C]pyrazole-5(1H, 4H,6H) carbaldehyde derivatives US Patent US8999981 Publication Date 4/7/2015
 
Protein kinase C beta type
Name:Protein kinase C beta type
Type:Enzyme
Mol. Mass.:76873.67
Organism:Homo sapiens (Human)
Description:The recombinant human PKC enzymes were produced using a baculovirus expression system in SF9 cells
Residue:671
BDBM153995
NameBDBM153995
Synonyms:US8999981, F51
TypeSmall organic molecule
Emp. Form.C27H39N7O3
Mol. Mass.509.6437
SMILESCCc1ccc(nc1)C(=O)Nc1n[nH]c2c1CN(C(=O)N1C[C@@H](C)N(C[C@@H]1C)C1CCOCC1)C2(C)C