Reaction Details
TargetPhospholipase D2
LigandBDBM154517
Substrate/Competitorn/a
Meas. Tech.In vivo Deuterated 1-Butanol PLD Assay
IC50 20±1 nM
Citation Scott, SASpencer, CTO'Reilly, MCBrown, KALavieri, RRCho, CHJung, DILarock, RCBrown, HALindsley, CW Discovery of desketoraloxifene analogues as inhibitors of mammalian, Pseudomonas aeruginosa, and NAPE phospholipase D enzymes. ACS Chem Biol10:421-32 (2015) 
 
Phospholipase D2
Name:Phospholipase D2
Type:Protein
Mol. Mass.:106002.47
Organism:Homo sapiens (Human)
Description:n/a
Residue:933
BDBM154517
NameBDBM154517
Synonyms:ML299 (5)
TypeSmall organic molecule
Emp. Form.C23H26BrFN4O2
Mol. Mass.489.381
SMILESC[C@@H](CN1CCC2(CC1)N(CNC2=O)c1cccc(F)c1)NC(=O)c1ccc(Br)cc1