Reaction Details
TargetPhospholipase
LigandBDBM20607
Substrate/Competitorn/a
Meas. Tech.Exogenous PldA Assay
pH7.5±n/a
IC50 15000±260 nM
Commentsextracted
Citation Scott, SASpencer, CTO'Reilly, MCBrown, KALavieri, RRCho, CHJung, DILarock, RCBrown, HALindsley, CW Discovery of desketoraloxifene analogues as inhibitors of mammalian, Pseudomonas aeruginosa, and NAPE phospholipase D enzymes. ACS Chem Biol10:421-32 (2015) 
 
Phospholipase
Name:Phospholipase
Synonyms:Phospholipase D (PldA)
Type:Protein
Mol. Mass.:122309.70
Organism:Pseudomonas aeruginosa (g-Proteobacteria)
Description:A0A0C6EPQ5
Residue:1099
BDBM20607
NameBDBM20607
TypeSmall organic molecule
Emp. Form.C26H29NO
Mol. Mass.371.5146
SMILESCC\C(=C(/c1ccccc1)c1ccc(OCCN(C)C)cc1)c1ccccc1