Reaction Details
TargetTP53-binding protein 1
LigandBDBM154551
Substrate/Competitorn/a
Meas. Tech.AlphaScreen Assay
pH8±0
Temperature1663.9±0 K
IC50>1.00e+5±n/a nM
Citation Perfetti, MTBaughman, BMDickson, BMMu, YCui, GMader, PDong, ANorris, JLRothbart, SBStrahl, BDBrown, PJJanzen, WPArrowsmith, CHMer, GMcBride, KMJames, LIFrye, SV Identification of a fragment-like small molecule ligand for the methyl-lysine binding protein, 53BP1. ACS Chem Biol10:1072-81 (2015) 
 
TP53-binding protein 1
Name:TP53-binding protein 1
Type:PROTEIN
Mol. Mass.:213442.98
Organism:Homo sapiens (Human)
Description:ChEMBL_107658
Residue:1972
BDBM154551
NameBDBM154551
Synonyms:3-Bromo-N-(3-(tert-butylamino)propyl)benzenesulfonamide (7)
TypeSmall organic molecule
Emp. Form.C13H21BrN2O2S
Mol. Mass.349.287
SMILESCC(C)(C)NCCCNS(=O)(=O)c1cccc(Br)c1