Reaction Details
TargetTP53-binding protein 1
LigandBDBM154563
Substrate/Competitorn/a
Meas. Tech.AlphaScreen Assay
pH8±0
Temperature1390.75±0 K
IC50 1.3e+4± 4.8e+3 nM
Citation Perfetti, MTBaughman, BMDickson, BMMu, YCui, GMader, PDong, ANorris, JLRothbart, SBStrahl, BDBrown, PJJanzen, WPArrowsmith, CHMer, GMcBride, KMJames, LIFrye, SV Identification of a fragment-like small molecule ligand for the methyl-lysine binding protein, 53BP1. ACS Chem Biol10:1072-81 (2015) 
 
TP53-binding protein 1
Name:TP53-binding protein 1
Type:PROTEIN
Mol. Mass.:213442.98
Organism:Homo sapiens (Human)
Description:ChEMBL_107658
Residue:1972
BDBM154563
NameBDBM154563
Synonyms:N-(3-(Tert-butylamino)propyl)-3-iodobenzamide (19)
TypeSmall organic molecule
Emp. Form.C14H21IN2O
Mol. Mass.360.2338
SMILESCC(C)(C)NCCCNC(=O)c1cccc(I)c1