Reaction Details
TargetTP53-binding protein 1
LigandBDBM154565
Substrate/Competitorn/a
Meas. Tech.AlphaScreen Assay
pH8±0
Temperature1390.75±0 K
IC50 2.2e+4± 1.4e+4 nM
Citation Perfetti, MTBaughman, BMDickson, BMMu, YCui, GMader, PDong, ANorris, JLRothbart, SBStrahl, BDBrown, PJJanzen, WPArrowsmith, CHMer, GMcBride, KMJames, LIFrye, SV Identification of a fragment-like small molecule ligand for the methyl-lysine binding protein, 53BP1. ACS Chem Biol10:1072-81 (2015) 
 
TP53-binding protein 1
Name:TP53-binding protein 1
Type:PROTEIN
Mol. Mass.:213442.98
Organism:Homo sapiens (Human)
Description:ChEMBL_107658
Residue:1972
BDBM154565
NameBDBM154565
Synonyms:N-(3-(Tert-butylamino)propyl)-3-(trifluoromethyl)benzamide (21)
TypeSmall organic molecule
Emp. Form.C15H21F3N2O
Mol. Mass.302.3352
SMILESCC(C)(C)NCCCNC(=O)c1cccc(c1)C(F)(F)F