Reaction Details
TargetChromobox protein homolog 7
LigandBDBM154563
Substrate/Competitorn/a
Meas. Tech.AlphaScreen Assay
pH8±0
Temperature1390.75±0 K
IC50>1.00e+5±n/a nM
Citation Perfetti, MTBaughman, BMDickson, BMMu, YCui, GMader, PDong, ANorris, JLRothbart, SBStrahl, BDBrown, PJJanzen, WPArrowsmith, CHMer, GMcBride, KMJames, LIFrye, SV Identification of a fragment-like small molecule ligand for the methyl-lysine binding protein, 53BP1. ACS Chem Biol10:1072-81 (2015) 
 
Chromobox protein homolog 7
Name:Chromobox protein homolog 7
Type:Protein
Mol. Mass.:28351.76
Organism:Homo sapiens (Human)
Description:n/a
Residue:251
BDBM154563
NameBDBM154563
Synonyms:N-(3-(Tert-butylamino)propyl)-3-iodobenzamide (19)
TypeSmall organic molecule
Emp. Form.C14H21IN2O
Mol. Mass.360.2338
SMILESCC(C)(C)NCCCNC(=O)c1cccc(I)c1