Reaction Details
TargetCyclin-dependent kinase 2 [A144C]
LigandBDBM154576
Substrate/Competitorn/a
Meas. Tech.ITC Assay
pH7.5±0
Temperature1107.6±0 K
Kd 15.4±2.3 nM
Citation Alexander, LTMöbitz, HDrueckes, PSavitsky, PFedorov, OElkins, JMDeane, CMCowan-Jacob, SWKnapp, S Type II Inhibitors Targeting CDK2. ACS Chem Biol10:2116-25 (2015) 
 
Cyclin-dependent kinase 2 [A144C]
Name:Cyclin-dependent kinase 2 [A144C]
Type:Protein
Mol. Mass.:33970.24
Organism:Homo sapiens (Human)
Description:CDK2 mutant (A144C)
Residue:298
BDBM154576
NameBDBM154576
Synonyms:K03861 (1)
TypeSmall organic molecule
Emp. Form.C24H26F3N7O2
Mol. Mass.501.5041
SMILESCN1CCN(Cc2ccc(NC(=O)Nc3ccc(Oc4ccnc(N)n4)cc3)cc2C(F)(F)F)CC1