Reaction Details
TargetCyclin-dependent kinase 2 [A144G]
LigandBDBM154576
Substrate/Competitorn/a
Meas. Tech.EMSA
pH7.5±n/a
IC50>1.0e+4±n/a nM
Commentsextracted
Citation Alexander, LTMöbitz, HDrueckes, PSavitsky, PFedorov, OElkins, JMDeane, CMCowan-Jacob, SWKnapp, S Type II Inhibitors Targeting CDK2. ACS Chem Biol10:2116-25 (2015) 
 
Cyclin-dependent kinase 2 [A144G]
Name:Cyclin-dependent kinase 2 [A144G]
Type:Protein
Mol. Mass.:33924.15
Organism:Homo sapiens (Human)
Description:P24941[A144G]
Residue:298
BDBM154576
NameBDBM154576
Synonyms:K03861 (1)
TypeSmall organic molecule
Emp. Form.C24H26F3N7O2
Mol. Mass.501.5041
SMILESCN1CCN(Cc2ccc(NC(=O)Nc3ccc(Oc4ccnc(N)n4)cc3)cc2C(F)(F)F)CC1