Reaction Details
TargetCyclin-dependent kinase 2 [F80M]
LigandBDBM154577
Substrate/Competitorn/a
Meas. Tech.EMSA
Temperature576.3±0 K
IC50>1.0e+4±n/a nM
Citation Alexander, LTMöbitz, HDrueckes, PSavitsky, PFedorov, OElkins, JMDeane, CMCowan-Jacob, SWKnapp, S Type II Inhibitors Targeting CDK2. ACS Chem Biol10:2116-25 (2015) 
 
Cyclin-dependent kinase 2 [F80M]
Name:Cyclin-dependent kinase 2 [F80M]
Type:Protein
Mol. Mass.:33922.20
Organism:Homo sapiens (Human)
Description:P24941[F80M]
Residue:298
BDBM154577
NameBDBM154577
Synonyms:K03859 (2)
TypeSmall organic molecule
Emp. Form.C30H29F3N6O3
Mol. Mass.578.5849
SMILESCN1CCN(Cc2ccc(NC(=O)c3cccc4cc(Oc5cc(NC(C)=O)ncn5)ccc34)cc2C(F)(F)F)CC1