Reaction Details
TargetMitogen-activated protein kinase 1
LigandBDBM154599
Substrate/Competitorn/a
Meas. Tech.Coupled ERK2 (cERK) Assay
pH7.2±n/a
Temperature298.15±n/a K
IC50 2.9±n/a nM
Commentsextracted
Citation Deng, YZhu, LShipps, Jr., GWLo, SSun, BHuang, XBienstock, CCooper, ABGao, XYao, XZhu, HYKelly, JMBoga, SBAlhassan, ATagat, JRMansoor, UFWilson, KJO'Boyle, BMDaniels, MHSchell, ASiliphaivanh, PFischer, C Heterocyclic compounds as ERK inhibitors US Patent US8999957 Publication Date 4/7/2015
 
Mitogen-activated protein kinase 1
Name:Mitogen-activated protein kinase 1
Type:Protein
Mol. Mass.:41278.65
Organism:Mus musculus (Mouse)
Description:P63085
Residue:358
BDBM154599
NameBDBM154599
Synonyms:US8999957, Column 153, Compound 4 | US8999957, Table 1, Compound 6
TypeSmall organic molecule
Emp. Form.C25H25N5O
Mol. Mass.411.4989
SMILESO=C(N[C@@H]1CCCN(Cc2ccccc2)C1)c1ccc2[nH]nc(-c3ccncc3)c2c1