Reaction Details
TargetMitogen-activated protein kinase 1
LigandBDBM154745
Substrate/Competitorn/a
Meas. Tech.IMAP Assay
IC50 4.455±n/a nM
Citation Deng, YZhu, LShipps, Jr., GWLo, SSun, BHuang, XBienstock, CCooper, ABGao, XYao, XZhu, HYKelly, JMBoga, SBAlhassan, ATagat, JRMansoor, UFWilson, KJO'Boyle, BMDaniels, MHSchell, ASiliphaivanh, PFischer, C Heterocyclic compounds as ERK inhibitors US Patent US8999957 Publication Date 4/7/2015
 
Mitogen-activated protein kinase 1
Name:Mitogen-activated protein kinase 1
Type:Protein
Mol. Mass.:41278.65
Organism:Mus musculus (Mouse)
Description:P63085
Residue:358
BDBM154745
NameBDBM154745
Synonyms:US8999957, Table 3, Compound 17 | US8999957, Table 3, Compound 77
TypeSmall organic molecule
Emp. Form.C29H26F4N6O2
Mol. Mass.566.5494
SMILESCOc1cccc(F)c1CN1C[C@@H](C[C@@H](C1)C(F)(F)F)NC(=O)c1ccc2[nH]nc(-c3ccc4nccn4c3)c2c1