Reaction Details
TargetMitogen-activated protein kinase 1
LigandBDBM154811
Substrate/Competitorn/a
Meas. Tech.IMAP Assay
IC50 2.41±n/a nM
Citation Deng, YZhu, LShipps, Jr., GWLo, SSun, BHuang, XBienstock, CCooper, ABGao, XYao, XZhu, HYKelly, JMBoga, SBAlhassan, ATagat, JRMansoor, UFWilson, KJO'Boyle, BMDaniels, MHSchell, ASiliphaivanh, PFischer, C Heterocyclic compounds as ERK inhibitors US Patent US8999957 Publication Date 4/7/2015
 
Mitogen-activated protein kinase 1
Name:Mitogen-activated protein kinase 1
Type:Protein
Mol. Mass.:41278.65
Organism:Mus musculus (Mouse)
Description:P63085
Residue:358
BDBM154811
NameBDBM154811
Synonyms:BDBM154818 | US8999957, Table 3, Compound 83
TypeSmall organic molecule
Emp. Form.C28H29FN6O3
Mol. Mass.516.5667
SMILESCNC(=O)[C@@H]1CC[C@H](CN1Cc1c(F)cccc1OC)NC(=O)c1ccc2[nH]nc(-c3ccncc3)c2c1