Reaction Details
TargetMitogen-activated protein kinase 1
LigandBDBM154864
Substrate/Competitorn/a
Meas. Tech.IMAP Assay
IC50 1±n/a nM
Citation Deng, YZhu, LShipps, Jr., GWLo, SSun, BHuang, XBienstock, CCooper, ABGao, XYao, XZhu, HYKelly, JMBoga, SBAlhassan, ATagat, JRMansoor, UFWilson, KJO'Boyle, BMDaniels, MHSchell, ASiliphaivanh, PFischer, C Heterocyclic compounds as ERK inhibitors US Patent US8999957 Publication Date 4/7/2015
 
Mitogen-activated protein kinase 1
Name:Mitogen-activated protein kinase 1
Type:Protein
Mol. Mass.:41278.65
Organism:Mus musculus (Mouse)
Description:P63085
Residue:358
BDBM154864
NameBDBM154864
Synonyms:US8999957, Table 3, Compound 137
TypeSmall organic molecule
Emp. Form.C28H30FN7O3
Mol. Mass.531.5813
SMILESCOc1cccc(F)c1CN1C[C@@H](CC[C@H]1C(=O)NN)NC(=O)c1ccc2[nH]nc(-c3ccnc(C)c3)c2c1