Reaction Details
TargetMitogen-activated protein kinase 1
LigandBDBM154902
Substrate/Competitorn/a
Meas. Tech.IMAP Assay
IC50 1.59±n/a nM
Citation Deng, YZhu, LShipps, Jr., GWLo, SSun, BHuang, XBienstock, CCooper, ABGao, XYao, XZhu, HYKelly, JMBoga, SBAlhassan, ATagat, JRMansoor, UFWilson, KJO'Boyle, BMDaniels, MHSchell, ASiliphaivanh, PFischer, C Heterocyclic compounds as ERK inhibitors US Patent US8999957 Publication Date 4/7/2015
 
Mitogen-activated protein kinase 1
Name:Mitogen-activated protein kinase 1
Type:Protein
Mol. Mass.:41278.65
Organism:Mus musculus (Mouse)
Description:P63085
Residue:358
BDBM154902
NameBDBM154902
Synonyms:US8999957, Table 4, Compound 7
TypeSmall organic molecule
Emp. Form.C28H26F2N6O
Mol. Mass.500.5424
SMILESCN1C[C@H](Cc2c(F)cccc2F)C[C@@H](C1)NC(=O)c1ccc2[nH]nc(-c3ccn4ccnc4c3)c2c1