Reaction Details
TargetOrexin receptor type 2
LigandBDBM154933
Substrate/Competitorn/a
Meas. Tech.In Vitro Assay
Temperature310.15±n/a K
IC50 3±n/a nM
Commentsextracted
Citation Boss, CBrotschi, CGatfield, JGude, MHeidmann, BSifferlen, TWilliams, JT Proline sulfonamide derivatives as orexin receptor antagonists US Patent US9000029 Publication Date 4/7/2015
 
Orexin receptor type 2
Name:Orexin receptor type 2
Type:Protein
Mol. Mass.:50710.53
Organism:Homo sapiens (Human)
Description:O43614
Residue:444
BDBM154933
NameBDBM154933
Synonyms:US9000029, 12
TypeSmall organic molecule
Emp. Form.C19H21ClN2O3S2
Mol. Mass.424.965
SMILESCSc1cccc(NC(=O)[C@@H]2CCCN2S(=O)(=O)c2ccc(C)c(Cl)c2)c1