Reaction Details
TargetOrexin receptor type 2
LigandBDBM154947
Substrate/Competitorn/a
Meas. Tech.In Vitro Assay
Temperature310.15±n/a K
IC50 5±n/a nM
Commentsextracted
Citation Boss, CBrotschi, CGatfield, JGude, MHeidmann, BSifferlen, TWilliams, JT Proline sulfonamide derivatives as orexin receptor antagonists US Patent US9000029 Publication Date 4/7/2015
 
Orexin receptor type 2
Name:Orexin receptor type 2
Type:Protein
Mol. Mass.:50710.53
Organism:Homo sapiens (Human)
Description:O43614
Residue:444
BDBM154947
NameBDBM154947
Synonyms:US9000029, 26
TypeSmall organic molecule
Emp. Form.C20H24N2O4S
Mol. Mass.388.481
SMILESCOc1ccc(cc1)S(=O)(=O)N1CCC[C@H]1C(=O)Nc1cc(C)cc(C)c1