Reaction Details
TargetProstaglandin D2 receptor 2
LigandBDBM155041
Substrate/Competitorn/a
Meas. Tech.Fluorometric Imaging Plate Reader (FLIPR) Assay
IC50 0.1±n/a nM
Citation Firooznia, FLin, TMertz, ESo, SSidduri, ATilley, JW Substituted naphthylacetic acids US Patent US9000044 Publication Date 4/7/2015
 
Prostaglandin D2 receptor 2
Name:Prostaglandin D2 receptor 2
Type:Enzyme
Mol. Mass.:43295.45
Organism:Homo sapiens (Human)
Description:Q9Y5Y4
Residue:395
BDBM155041
NameBDBM155041
Synonyms:US9000044, 60
TypeSmall organic molecule
Emp. Form.C27H18F7NO4S
Mol. Mass.585.49
SMILESCc1c(CC(O)=O)cc2ccc(F)cc2c1-c1ccc(NS(=O)(=O)c2cc(cc(c2)C(F)(F)F)C(F)(F)F)cc1