Reaction Details
TargetAmyloid-beta precursor protein
LigandBDBM155106
Substrate/Competitorn/a
Meas. Tech.Release Assay
Temperature310.15±n/a K
IC50 2.5±n/a nM
Commentsextracted
Citation Karlstrom, SCsjernyik, GSwahn, BSandberg, LKolmodin, KSoderman, POhberg, L 2H-imidazol-4-amine compounds and their use as BACE inhibitors US Patent US9000182 Publication Date 4/7/2015
 
Amyloid-beta precursor protein
Name:Amyloid-beta precursor protein
Type:Single-pass type I membrane protein
Mol. Mass.:86890.41
Organism:Homo sapiens (Human)
Description:P05067
Residue:770
BDBM155106
NameBDBM155106
Synonyms:US9000182, 14
TypeSmall organic molecule
Emp. Form.C21H28FN3O2
Mol. Mass.373.4643
SMILESCO[C@H]1CC[C@@]2(Cc3ccc(OCC(C)F)cc3C22N=C(C)C(N)=N2)CC1