Reaction Details
TargetAmyloid-beta precursor protein
LigandBDBM155123
Substrate/Competitorn/a
Meas. Tech.Release Assay
Temperature310.15±n/a K
IC50 4.8±n/a nM
Commentsextracted
Citation Karlstrom, SSoderman, PRakos, LOhberg, LKolmodin, KSandberg, L Cyclohexane-1,2′-indene-1′,2″-imidazol compounds and their use as BACE inhibitors US Patent US9000183 Publication Date 4/7/2015
 
Amyloid-beta precursor protein
Name:Amyloid-beta precursor protein
Type:Single-pass type I membrane protein
Mol. Mass.:86890.41
Organism:Homo sapiens (Human)
Description:P05067
Residue:770
BDBM155123
NameBDBM155123
Synonyms:US9000183, 8
TypeSmall organic molecule
Emp. Form.C25H24F2N4O
Mol. Mass.434.4811
SMILESCO[C@H]1CC[C@@]2(Cc3cc(F)c(cc3C22N=C(C)C(N)=N2)-c2cc(F)cc(c2)C#N)CC1