Reaction Details
TargetAmyloid-beta precursor protein
LigandBDBM155135
Substrate/Competitorn/a
Meas. Tech.Release Assay
Temperature310.15±n/a K
IC50 2.5±n/a nM
Commentsextracted
Citation Karlstrom, SSandberg, LSoderman, PKolmodin, KOhberg, L Cyclohexane-1,2′-naphthalene-1′,2″-imidazol compounds and their use as BACE inhibitors US Patent US9000184 Publication Date 4/7/2015
 
Amyloid-beta precursor protein
Name:Amyloid-beta precursor protein
Type:Single-pass type I membrane protein
Mol. Mass.:86890.41
Organism:Homo sapiens (Human)
Description:P05067
Residue:770
BDBM155135
NameBDBM155135
Synonyms:US9000184, 7, isomer 1
TypeSmall organic molecule
Emp. Form.C24H27ClN4O
Mol. Mass.422.95
SMILESCO[C@H]1CC[C@]2(CC1)CCc1ccc(cc1C21N=C(C)C(N)=N1)-c1cncc(Cl)c1