Reaction Details
TargetAmyloid-beta precursor protein
LigandBDBM155147
Substrate/Competitorn/a
Meas. Tech.Release Assay
Temperature310.15±n/a K
IC50 0.9±n/a nM
Commentsextracted
Citation Karlstrom, SSoderman, PSwahn, BRakos, LOhberg, L Cycloalkyl ether compounds and their use as BACE inhibitors US Patent US9000185 Publication Date 4/7/2015
 
Amyloid-beta precursor protein
Name:Amyloid-beta precursor protein
Type:Single-pass type I membrane protein
Mol. Mass.:86890.41
Organism:Homo sapiens (Human)
Description:P05067
Residue:770
BDBM155147
NameBDBM155147
Synonyms:US9000185, 4, isomer 1
TypeSmall organic molecule
Emp. Form.C22H29N3O2
Mol. Mass.367.4846
SMILESCO[C@H]1CC[C@@]2(Cc3ccc(OCC4CC4)cc3[C@@]22N=C(C)C(N)=N2)CC1