Reaction Details
TargetNeprilysin
LigandBDBM153108
Substrate/Competitorn/a
Meas. Tech.Fluorescence Lifetime-Based Assay
pH7.4±n/a
Temperature298.15±n/a K
IC50 1±n/a nM
Commentsextracted
Citation Coppola, GMIwaki, YKarki, RGKawanami, TKsander, GMMogi, MSun, R Substituted aminobutyric derivatives as neprilysin inhibitors US Patent US9006249 Publication Date 4/14/2015
 
Neprilysin
Name:Neprilysin
Type:Enzyme
Mol. Mass.:85505.38
Organism:Homo sapiens (Human)
Description:P08473
Residue:750
BDBM153108
NameBDBM153108
Synonyms:US8993631, 16-5 US9603819, Example 3-32
TypeSmall organic molecule
Emp. Form.C24H23N3O5
Mol. Mass.433.4565
SMILESC[C@H](C[C@@H](Cc1ccc(cc1)-c1ccccc1)NC(=O)c1cc(ncn1)C(O)=O)C(O)=O