Reaction Details
Target3-hydroxy-3-methylglutaryl-coenzyme A reductase
LigandBDBM155374
Substrate/Competitorn/a
Meas. Tech.Reductase Assay
pH7.2±n/a
IC50<1±n/a nM
Commentsextracted
Citation Lindsay, DJackson, PHindley, SBhamra, I Rosuvastatin and atorvastatin derivatives US Patent US9006282 Publication Date 4/14/2015
 
3-hydroxy-3-methylglutaryl-coenzyme A reductase
Name:3-hydroxy-3-methylglutaryl-coenzyme A reductase
Type:Enzyme
Mol. Mass.:96689.85
Organism:Rattus norvegicus (rat)
Description:Isolated rat liver microsomes were used as enzyme source.
Residue:887
BDBM155374
NameBDBM155374
Synonyms:US9006282, Example 2, Compound 2 | US9102656, Example 2, Compound 1
TypeSmall organic molecule
Emp. Form.C29H33FN4O6S
Mol. Mass.584.659
SMILESCOC1C[C@@H](C[C@H](O1)\C=C\c1c(nc(nc1-c1ccc(F)cc1)N(C)S(C)(=O)=O)C(C)C)OC(=O)c1cccnc1