Reaction Details
Target3-hydroxy-3-methylglutaryl-coenzyme A reductase
LigandBDBM155390
Substrate/Competitorn/a
Meas. Tech.Reductase Assay
pH7.2±n/a
IC50<1±n/a nM
Commentsextracted
Citation Lindsay, DJackson, PHindley, SBhamra, I Rosuvastatin and atorvastatin derivatives US Patent US9006282 Publication Date 4/14/2015
 
3-hydroxy-3-methylglutaryl-coenzyme A reductase
Name:3-hydroxy-3-methylglutaryl-coenzyme A reductase
Type:Enzyme
Mol. Mass.:96689.85
Organism:Rattus norvegicus (rat)
Description:Isolated rat liver microsomes were used as enzyme source.
Residue:887
BDBM155390
NameBDBM155390
Synonyms:US9006282, Example 3, Compound 9
TypeSmall organic molecule
Emp. Form.C41H43FN2O6
Mol. Mass.678.7883
SMILESCOc1ccc(OC2C[C@H](O)C[C@@H](CCn3c(C(C)C)c(C(=O)Nc4ccccc4)c(c3-c3ccc(F)cc3)-c3ccccc3)O2)c(OC)c1