Reaction Details
TargetFibroblast growth factor receptor 1
LigandBDBM286987
Substrate/Competitorn/a
Meas. Tech.Caliper-Based Kinase Assay
Temperature298.15±n/a K
IC50 0.100±n/a nM
Commentsextracted
Citation Verner, EBrameld, KA Quinolone derivatives as fibroblast growth factor receptor inhibitors US Patent US9567334 Publication Date 2/14/2017
 
Fibroblast growth factor receptor 1
Name:Fibroblast growth factor receptor 1
Type:Receptor
Mol. Mass.:91861.70
Organism:Homo sapiens (Human)
Description:P11362
Residue:822
BDBM286987
NameBDBM286987
Synonyms:8-(3-(4-acryloylpiperazin-1-yl)propyl)-2-((cyclopropylmethyl)amino)-6-(2,6-dichloro-3,5-dimethoxyphenyl)pyrido[2,3-d]pyrimidin-7(8H)-one US11078199, Cpd 7 US9815834, Compound 7
TypeSmall organic molecule
Emp. Form.C29H34Cl2N6O4
Mol. Mass.601.524
SMILESCOc1cc(OC)c(Cl)c(c1Cl)-c1cc2cnc(NCC3CC3)nc2n(CCCN2CCN(CC2)C(=O)C=C)c1=O