Reaction Details
TargetATP-sensitive inward rectifier potassium channel 1
LigandBDBM155921
Substrate/Competitorn/a
Meas. Tech.Electrophysiology Assay
pH7.4±n/a
IC50 9±n/a nM
Commentsextracted
Citation Pasternak, AZhu, YShahripour, ATang, HYang, LWalsh, SPTeumelsan, NH Inhibitors of the renal outer medullary potassium channel US Patent US9018211 Publication Date 4/28/2015
 
ATP-sensitive inward rectifier potassium channel 1
Name:ATP-sensitive inward rectifier potassium channel 1
Type:Enzyme
Mol. Mass.:44976.27
Organism:Rattus norvegicus (Rat)
Description:P35560
Residue:391
BDBM155921
NameBDBM155921
Synonyms:US9018211, 2A
TypeSmall organic molecule
Emp. Form.C26H30N2O6
Mol. Mass.466.5262
SMILESCc1c2COC(=O)c2ccc1[C@@H](O)CN1CCN(C[C@H](O)c2ccc3C(=O)OCc3c2C)CC1